{"text_format":"3","workbook":"xlsx","n_sheets":4,"sheets":["Club","Joueur","classement club","Code couleur"],"not_rendered":{"macros":1,"external_links":1,"defined_names":4},"read":"whole","date_system":"1900"}

{"sheet":"Club","index":0,"n_rows":631,"n_cols":56,"rows_kept":631,"merged":[[0,10,0,11],[0,13,0,14],[0,38,0,39],[0,40,0,41],[0,49,0,50],[2,18,628,18]]}
[{"$nulls":5},"Chuisnes","B.O.C.","Crécy","Charpont","Bonneval","Luray",null,"Vichères","Challet - Bailleau",null,"Cloyes","St G.M.","Bonneval","Yèvres","St Eliph","Blévy M","Challet - B","Cloyes","Charpont","Chuisnes","Cheminots","Cheminots","B.O.C.","Ouarville","Luray","St G.M.","La Gauloise","Gas","Charpont","B.O.C.","Blévy M","La Gauloise","Ouarville","Luray",null,"Yèvres",null,"Crécy","St Eliph","Challet - B","Vichères","B.O.C.","Charpont","Luray","La Gauloise",null,"Gas","St Eliph","TOTAL"]
[null,"Club","nom prénom","concours nbs",{"$f":"NumCouleur(D2)","v":{"$error":"#NAME?"}},"2024-09-01","2024-09-07","2024-09-08","2024-09-14","2024-09-15","21/09/2024   TRI","21/09/2024         DM","22/09/2024    QUA","28/09/2024   TRI","28/09/2024         DF","2024-09-29","2024-10-05","2024-10-06","2024-10-12","2024-10-13","2024-10-19","2024-10-20","2024-10-26","2024-10-27","2024-11-02","2024-11-03","2024-11-09","2024-11-10","2024-11-16","2024-11-17","2024-11-23","2024-11-24","2024-11-30","2025-03-01","2025-03-02","2025-03-08","2025-03-09","2025-03-15","16/03/2025      DOU","16/03/2025    DM","22/03/2025      DOU","22/03/2025    DM","2025-03-23","2025-03-29","2025-04-05","06/04/2025   TRI-M","2025-04-12","2025-04-13","2025-04-19","26/04/2025      DOU","26/04/2025    DM","2025-04-27","2025-05-03","individuel"]
[1,"BLEVY MAILLEBOIS","BIDARD Philippe",{"$f":"COUNTIF(F3:BA3,\">1\")","v":6},"HVS",{"$nulls":13},"ANNULÉ",12,15,10,null,10,10,10,{"$nulls":27},{"$f":"SUM(F3:BA3)","v":67},2]
[2,"BLEVY MAILLEBOIS","BOULAY Christophe",0,"HAD",{"$nulls":48},0,2]
[3,"BLEVY MAILLEBOIS","BRETAGNE Fabien",1,"HAS",{"$nulls":15},10,{"$nulls":32},10,2]
[4,"BLEVY MAILLEBOIS","BURSON Anthony",3,"HAS",{"$nulls":3},12,{"$nulls":7},12,{"$nulls":3},10,{"$nulls":32},34,2]
[5,"BLEVY MAILLEBOIS","DUFOSSE Anthony",1,"HAS",{"$nulls":15},10,{"$nulls":32},10,2]
[6,"BLEVY MAILLEBOIS","FREMONT Benoît",12,"HVS",22,20,16,30,null,10,null,null,10,null,null,20,null,null,15,10,10,null,null,30,12,{"$nulls":27},205,2]
[7,"BLEVY MAILLEBOIS","FREMONT Denis",9,"HVS",null,null,12,10,null,10,null,null,10,null,null,16,null,null,15,{"$nulls":3},10,10,10,{"$nulls":27},103,2]
[8,"BLEVY MAILLEBOIS","FREMONT Stéphane",12,"HAS",22,20,16,30,null,10,null,null,10,null,null,20,null,null,15,10,10,null,null,30,12,{"$nulls":27},205,2]
[9,"BLEVY MAILLEBOIS","GAJAS Gaspard",0,"HAS",{"$nulls":48},0,2]
[10,"BLEVY MAILLEBOIS","GAUTIER Laurent",5,"HVS",{"$nulls":14},10,10,10,null,10,10,{"$nulls":28},50,2]
[11,"BLEVY MAILLEBOIS","GILLOT Julien",3,"HAS",{"$nulls":3},12,{"$nulls":10},10,10,{"$nulls":32},32,2]
[12,"BLEVY MAILLEBOIS","GILLOT Moïse",9,"HVS",null,null,12,10,null,10,null,null,10,null,null,16,null,null,15,{"$nulls":3},10,10,10,{"$nulls":27},103,2]
[13,"BLEVY MAILLEBOIS","GLOTIN Julien",1,"HAS",{"$nulls":11},12,{"$nulls":36},12,2]
[14,"BLEVY MAILLEBOIS","GREVIN Kaëlig",1,"HJS",{"$nulls":11},12,{"$nulls":36},12,2]
[15,"BLEVY MAILLEBOIS","GREVIN Michel",11,"HVS",null,10,10,10,{"$nulls":4},10,null,null,12,null,null,10,15,10,null,10,12,10,{"$nulls":27},119,2]
[16,"BLEVY MAILLEBOIS","GUGGENBUHL Claude",3,"HVS",{"$nulls":3},10,{"$nulls":6},10,{"$nulls":4},10,{"$nulls":32},30,2]
[17,"BLEVY MAILLEBOIS","HANDZICH Maryse",4,"FVS",{"$nulls":15},10,10,null,10,12,{"$nulls":28},42,2]
[18,"BLEVY MAILLEBOIS","JURE Eric",4,"HVS",{"$nulls":8},10,null,null,16,null,null,15,{"$nulls":3},10,{"$nulls":29},51,2]
[19,"BLEVY MAILLEBOIS","LARHANTEC Louis",3,"HVS",null,10,{"$nulls":6},10,{"$nulls":6},30,{"$nulls":32},50,2]
[20,"BLEVY MAILLEBOIS","LAUVRAY Raymonde",4,"FVD",{"$nulls":15},10,10,null,10,10,{"$nulls":28},40,2]
[21,"BLEVY MAILLEBOIS","LEMAIRE Raphael",5,"HAS",null,null,10,10,{"$nulls":4},10,{"$nulls":5},10,{"$nulls":3},10,{"$nulls":29},50,2]
[22,"BLEVY MAILLEBOIS","MACHADO Federico",4,"HVD",{"$nulls":14},10,10,10,null,10,{"$nulls":29},40,2]
[23,"BLEVY MAILLEBOIS","MAIA Christophe",10,"HAS",null,null,12,12,null,10,null,null,10,null,null,12,null,null,10,10,null,null,10,10,10,{"$nulls":27},106,2]
[24,"BLEVY MAILLEBOIS","MARTIN Antoine",1,"HAS",{"$nulls":15},10,{"$nulls":32},10,2]
[25,"BLEVY MAILLEBOIS","MARTIN Eric",9,"HVS",null,10,10,{"$nulls":5},10,null,null,12,null,null,12,30,10,null,null,12,10,{"$nulls":27},116,2]
[26,"BLEVY MAILLEBOIS","MARTIN Gaëtan",6,"HAS",null,null,10,{"$nulls":5},10,{"$nulls":5},12,30,10,{"$nulls":3},10,{"$nulls":27},82,2]
[27,"BLEVY MAILLEBOIS","MARTIN Pierre",3,"HAS",null,null,10,{"$nulls":13},10,{"$nulls":3},10,{"$nulls":27},30,2]
[28,"BLEVY MAILLEBOIS","MOREAU Baptiste",2,"HAS",{"$nulls":3},10,{"$nulls":6},10,{"$nulls":37},20,2]
[29,"BLEVY MAILLEBOIS","MORIN Anthony",0,"HAS",{"$nulls":48},0,2]
[30,"BLEVY MAILLEBOIS","SMIESCZAK Thibaut",3,"HAS",null,null,10,{"$nulls":12},15,{"$nulls":4},10,{"$nulls":27},35,2]
[31,"BLEVY MAILLEBOIS","TROUILLET Baptiste",0,"HAS",{"$nulls":48},0,2]
[32,"BLEVY MAILLEBOIS","VAZQUEZ Baptiste",8,"HAS",null,20,16,null,null,10,{"$nulls":5},20,{"$nulls":3},10,10,null,null,30,12,{"$nulls":27},128,2]
[33,"BLEVY MAILLEBOIS","WEISS Julien",{"$f":"COUNTIF(F35:BA35,\">1\")","v":2},"HAS",{"$nulls":8},10,{"$nulls":6},10,{"$nulls":32},20,2,{"$f":"SUM(BB3:BB35)","v":1812}]
[34,"BONNEVAL","BEDOT Frédéric",3,"HVS",{"$nulls":4},14,{"$nulls":5},10,{"$nulls":6},15,{"$nulls":30},39,3]
[35,"BONNEVAL","BEDOT Marie Claire",0,"FVS",{"$nulls":48},0,3]
[36,"BONNEVAL","BOUILLY Eric",5,"HVS",{"$nulls":4},15,{"$nulls":5},10,{"$nulls":4},10,null,15,null,10,{"$nulls":28},60,3]
[37,"BONNEVAL","BRETON Gilbert",2,"HVD",{"$nulls":4},14,{"$nulls":5},10,{"$nulls":37},24,3]
[38,"BONNEVAL","BRETON Patricia",1,"FVD",{"$nulls":10},10,{"$nulls":37},10,3]
[39,"BONNEVAL","COUDRAY Sylvain",2,"HAD",{"$nulls":12},10,{"$nulls":6},10,{"$nulls":28},20,3]
[40,"BONNEVAL","COURTOIS Victor",2,"HJS",{"$nulls":4},14,{"$nulls":5},10,{"$nulls":37},24,3]
[41,"BONNEVAL","DUVIGNEAU Jean François",1,"HVD",{"$nulls":20},12,{"$nulls":27},12,3]
[42,"BONNEVAL","FAVRÉ Mickael",2,"HAD",{"$nulls":4},16,{"$nulls":7},15,{"$nulls":35},31,3]
[43,"BONNEVAL","GALLAIS Janny",4,"HVD",{"$nulls":4},10,{"$nulls":7},10,{"$nulls":4},10,null,10,{"$nulls":28},40,3]
[44,"BONNEVAL","LACOSTE Phillippe",6,"HVD",{"$nulls":4},15,{"$nulls":5},10,null,15,null,null,10,null,15,null,10,{"$nulls":28},75,3]
[45,"BONNEVAL","LINGET Martine",3,"FVS",{"$nulls":10},10,null,10,{"$nulls":4},10,{"$nulls":30},30,3]
[46,"BONNEVAL","MATHIEU Maxime",1,"HAS",{"$nulls":4},16,{"$nulls":43},16,3]
[47,"BONNEVAL","MAUGET Bruno",3,"HVS",{"$nulls":4},15,{"$nulls":10},10,{"$nulls":3},10,{"$nulls":28},35,3]
[48,"BONNEVAL","PERRICHOT Denis",2,"HVS",{"$nulls":12},15,{"$nulls":7},12,{"$nulls":27},27,3]
[49,"BONNEVAL","THOMAS Eric",3,"HVD",{"$nulls":12},10,{"$nulls":6},10,12,{"$nulls":27},32,3]
[50,"BONNEVAL","VAUGLIN Marcel",4,"HVD",{"$nulls":4},10,{"$nulls":5},10,null,10,{"$nulls":4},10,{"$nulls":30},40,3]
[51,"BONNEVAL","VINCENZI Sylvain",1,"HVS",{"$nulls":4},16,{"$nulls":43},16,3,{"$f":"SUM(BB36:BB53)","v":531}]
[52,"BOUGLAINVAL","ALLOUIS Corentin",14,"HAD",10,15,18,10,10,15,null,10,10,null,10,10,18,null,15,{"$nulls":3},10,null,20,{"$nulls":27},181,4]
[53,"BOUGLAINVAL","ALLOUIS Stéphane",9,"HVS",20,18,null,12,null,15,null,10,10,{"$nulls":5},15,{"$nulls":3},10,null,10,{"$nulls":27},120,4]
[54,"BOUGLAINVAL","BATAYER Gilberte",0,"FVS",{"$nulls":48},0,4]
[55,"BOUGLAINVAL","BATAYER Yves",0,"HVS",{"$nulls":48},0,4]
[56,"BOUGLAINVAL","BOILLOD Sylvain",7,"HVS",null,10,{"$nulls":3},12,null,null,10,null,null,10,{"$nulls":3},15,null,null,10,10,{"$nulls":28},77,4]
[57,"BOUGLAINVAL","BREMAUD André",4,"HVD",null,null,10,null,null,12,{"$nulls":9},10,10,{"$nulls":31},42,4]
[58,"BOUGLAINVAL","CANALES Corinne",null,"FVD",{"$nulls":48},0,4]
{"$rows_left_out":572}
{"sheet":"Joueur","index":1,"n_rows":629,"n_cols":54,"rows_kept":629,"merged":[[0,10,0,11],[0,13,0,14],[0,38,0,39],[0,40,0,41],[0,49,0,50]]}
[{"$nulls":5},"Chuisnes","B.O.C.","Crécy","Charpont","Bonneval","Luray",null,"Vichères","Challet - Bailleau",null,"Cloyes","St G.M.","Bonneval","Yèvres","St Eliph","Blévy M","Challet - B","Cloyes","Charpont","Chuisnes","Cheminots","Cheminots","B.O.C.","Ouarville","Luray","St G.M.","La Gauloise","Gas","Charpont","B.O.C.","Blévy M","La Gauloise","Ouarville","Luray",null,"Yèvres",null,"Crécy","St Eliph","Challet - B","Vichères","B.O.C.","Charpont","Luray","La Gauloise",null,"Gas","St Eliph","TOTAL"]
[null,"Club","nom prénom","concours nbs",{"$f":"NumCouleur(D2)","v":{"$error":"#NAME?"}},"2024-09-01","2024-09-07","2024-09-08","2024-09-14","2024-09-15","21/09/2024   TRI","21/09/2024         DM","22/09/2024    QUA","28/09/2024   TRI","28/09/2024         DF","2024-09-29","2024-10-05","2024-10-06","2024-10-12","2024-10-13","2024-10-19","2024-10-20","2024-10-26","2024-10-27","2024-11-02","2024-11-03","2024-11-09","2024-11-10","2024-11-16","2024-11-17","2024-11-23","2024-11-24","2024-11-30","2025-03-01","2025-03-02","2025-03-08","2025-03-09","2025-03-15","16/03/2025      DOU","16/03/2025    DM","22/03/2025      DOU","22/03/2025    DM","2025-03-23","2025-03-29","2025-04-05","06/04/2025   TRI-M","2025-04-12","2025-04-13","2025-04-19","26/04/2025      DOU","26/04/2025    DM","2025-04-27","2025-05-03","individuel"]
[1,"CRECY- COUVE","COLOMBEL Jean François",{"$f":"COUNTIF(F3:BA3,\">1\")","v":11},"HVD",null,15,15,25,null,null,30,null,25,null,null,15,null,null,30,null,25,null,25,10,30,{"$nulls":27},{"$f":"SUM(F3:BA3)","v":245}]
[2,"VICHERES","BROZILLE Benoît",15,"HAS",10,null,22,10,null,null,18,30,20,null,15,null,15,null,18,15,10,15,10,15,15,{"$nulls":27},238]
[3,"LURAY","MARECHAL Maxime",16,"HAS",10,null,10,10,12,10,null,12,15,null,25,null,20,null,12,20,20,18,10,10,10,{"$nulls":27},224]
[4,"LURAY","POIRIER Philippe",13,"HAS",15,30,10,null,30,12,null,10,null,null,15,null,20,null,15,20,10,null,10,10,{"$nulls":28},207]
[5,"LURAY","VALLEE Louis",14,"HAS",15,30,10,null,null,12,null,10,20,null,10,null,20,null,15,20,10,null,10,15,10,{"$nulls":27},207]
[6,"BLEVY MAILLEBOIS","FREMONT Benoît",12,"HVS",22,20,16,30,null,10,null,null,10,null,null,20,null,null,15,10,10,null,null,30,12,{"$nulls":27},205]
[7,"BLEVY MAILLEBOIS","FREMONT Stéphane",12,"HAS",22,20,16,30,null,10,null,null,10,null,null,20,null,null,15,10,10,null,null,30,12,{"$nulls":27},205]
[8,"CRECY- COUVE","BROU David",14,"HAD",15,15,30,null,null,15,null,10,15,null,null,10,22,null,10,10,10,null,22,10,10,{"$nulls":27},204]
[9,"LURAY","LIGAVAN Karine",14,"FAS",10,null,12,10,30,10,null,20,null,20,10,null,15,null,12,15,10,10,null,null,14,{"$nulls":27},198]
[10,"CRECY- COUVE","LE HELLEY Marcel",13,"HVS",10,15,15,null,null,10,null,10,{"$nulls":3},22,22,null,10,10,10,null,20,10,30,{"$nulls":27},194]
[11,"VICHERES","GIRARD Laurent",13,"HAS",10,15,22,null,null,15,null,30,10,{"$nulls":3},10,null,10,20,null,12,10,18,10,{"$nulls":27},192]
[12,"BOUGLAINVAL","LE BRIS Fabrice",15,"HVS",15,18,null,null,10,15,null,10,10,null,12,14,null,null,10,25,10,10,10,10,10,{"$nulls":27},189]
[13,"CHARPONT","CEULEMANS Cédric",13,"HAS",null,10,10,null,null,30,null,25,10,null,null,10,null,null,15,10,15,12,10,20,10,{"$nulls":27},187]
[14,"LURAY","ROULEAU Jean-Charles",14,"HVS",30,12,12,12,12,10,null,10,12,null,15,{"$nulls":3},10,10,null,null,15,15,10,{"$nulls":27},185]
[15,"VICHERES","SAGOT Didier",13,"HVS",18,null,12,10,18,{"$nulls":3},10,null,10,null,30,null,20,null,10,12,10,12,10,{"$nulls":27},182]
[16,"BOUGLAINVAL","ALLOUIS Corentin",14,"HAD",10,15,18,10,10,15,null,10,10,null,10,10,18,null,15,{"$nulls":3},10,null,20,{"$nulls":27},181]
[17,"CRECY- COUVE","GOSNET Franck",9,"HAD",null,15,null,25,null,20,null,15,25,null,10,15,null,null,30,{"$nulls":3},25,{"$nulls":29},180]
[18,"LURAY","MARCHIORI Joel",14,"HVS",30,10,10,15,10,12,null,10,12,null,15,10,{"$nulls":3},10,null,null,10,12,10,{"$nulls":27},176]
[19,"VICHERES","PODWOJEWSKI Patrice",11,"HVD",{"$nulls":3},20,{"$nulls":3},22,10,null,20,null,30,null,10,20,null,12,10,12,10,{"$nulls":27},176]
[20,"LURAY","BURSON Ghislaine",13,"FAS",10,null,12,12,15,null,10,12,null,20,15,{"$nulls":4},15,20,null,10,10,14,{"$nulls":27},175]
[21,"LURAY","LIGAVAN Philippe",12,"HVD",10,10,15,10,15,null,null,20,null,null,20,15,15,null,25,null,null,10,null,10,{"$nulls":28},175]
[22,"CRECY- COUVE","LE MEUR Yoan",13,"HAS",10,15,20,10,null,15,null,null,15,null,null,22,null,null,10,10,12,null,12,10,10,{"$nulls":27},171]
[23,"VICHERES","LEBOSSE Brice",10,"HAS",null,null,22,{"$nulls":5},30,null,15,null,14,null,20,15,null,15,10,20,10,{"$nulls":27},171]
[24,"BOULES CLUB CLOYSIEN","MAURICE Marc",12,"HVS",{"$nulls":4},20,null,null,12,14,null,12,10,null,null,10,22,14,22,10,10,10,{"$nulls":27},166]
[25,"BOUGLAINVAL","LOREILLER Bruno",12,"HVD",10,null,10,10,null,12,null,16,10,null,null,10,null,null,15,25,12,null,10,25,{"$nulls":28},165]
[26,"BOULES CLUB CLOYSIEN","GERARD Frederique",9,"HAS",20,{"$nulls":3},22,null,20,null,10,null,18,{"$nulls":3},22,10,null,30,null,12,{"$nulls":28},164]
[27,"LURAY","PAPIN Jasmine",12,"FVD",15,10,15,10,null,null,25,10,null,16,10,{"$nulls":4},10,null,null,18,12,10,{"$nulls":27},161]
[28,"VICHERES","LETOURNEUR Christian",11,"HVS",10,null,15,10,15,null,null,15,15,{"$nulls":3},15,null,12,null,10,20,null,15,{"$nulls":28},152]
[29,"VICHERES","ESCULIER Christian",10,"HVS",10,null,12,20,{"$nulls":3},15,30,null,10,{"$nulls":3},10,null,10,null,null,18,15,{"$nulls":27},150]
[30,"LURAY","SORTAIS Luc",12,"HVS",15,12,null,10,{"$nulls":4},12,null,null,10,null,null,10,18,10,18,12,10,10,{"$nulls":27},147]
[31,"BOUGLAINVAL","COUELLAUD Walter",13,"HAS",null,10,null,10,10,10,null,10,10,null,10,10,null,null,10,null,10,10,10,25,{"$nulls":28},145]
[32,"LURAY","BURSON Denis",10,"HVS",10,10,10,10,30,10,null,20,15,null,20,{"$nulls":4},10,{"$nulls":32},145]
[33,"BOULES CLUB CLOYSIEN","PEAUGER Christian",11,"HVS",null,null,10,null,10,18,null,null,10,null,10,null,15,null,10,10,10,null,30,10,{"$nulls":28},143]
[34,"CHARPONT","NICHOLAS Thierry",12,"HVS",10,10,10,10,null,10,null,18,10,{"$nulls":6},10,10,null,15,20,10,{"$nulls":27},143]
[35,"CRECY- COUVE","BAZIRE Cédric",6,"HAD",25,null,null,18,{"$nulls":4},25,null,null,15,null,null,30,{"$nulls":5},30,{"$nulls":27},143]
[36,"CHARPONT","BOUVIER Carl",13,"HVS",15,10,10,10,null,10,null,12,15,{"$nulls":5},10,10,10,null,10,10,10,{"$nulls":27},142]
[37,"BOUGLAINVAL","MARTIN Gérard",11,"HVD",20,12,null,null,10,10,null,10,10,null,10,{"$nulls":4},15,14,null,10,null,20,{"$nulls":27},141]
[38,"BOULES CLUB CLOYSIEN","PATEYRON Michel",11,"HVS",{"$nulls":4},20,null,null,12,null,null,12,10,10,null,10,22,14,null,10,10,10,{"$nulls":27},140]
[39,"CHARPONT","JEANNOT Lucie",11,"FAS",null,10,10,{"$nulls":3},14,25,null,15,{"$nulls":4},10,10,15,null,10,10,10,{"$nulls":27},139]
[40,"LURAY","BOUDVIN Jérome",12,"HAS",10,12,10,10,null,null,10,null,10,null,null,10,null,null,10,10,20,null,15,null,10,{"$nulls":27},137]
[41,"VICHERES","LETOURNEUR Annick",10,"FVS",10,null,12,10,15,{"$nulls":4},25,null,null,10,null,10,null,10,20,null,15,{"$nulls":28},137]
[42,"SAINT ELIPH","BOUJU Marion",11,"FAS",10,null,10,10,null,null,20,{"$nulls":3},12,{"$nulls":3},14,10,15,15,10,null,10,{"$nulls":27},136]
[43,"CHARPONT","LAUVRAY sébastien",12,"HAS",15,14,10,10,null,null,16,10,10,{"$nulls":5},10,10,10,null,10,10,{"$nulls":28},135]
[44,"CRECY- COUVE","LANOE Christophe",11,"HVD",15,15,15,10,null,10,null,15,10,null,15,10,null,null,10,{"$nulls":3},10,{"$nulls":29},135]
[45,"CRECY- COUVE","LECOMTE Alexandra",8,"FAS",null,null,20,{"$nulls":3},30,15,{"$nulls":3},15,{"$nulls":3},10,25,null,10,10,{"$nulls":28},135]
[46,"VICHERES","BRISSONNET Angelique",11,"FAS",null,10,10,null,null,15,null,10,{"$nulls":4},15,null,10,15,null,12,10,18,10,{"$nulls":27},135]
[47,"SAINT ELIPH","LOMBARD Roméo",9,"HAS",{"$nulls":8},22,null,null,10,20,null,20,10,15,15,10,10,{"$nulls":28},132]
[48,"CHARPONT","DELAMARE Hervé",12,"HVD",10,{"$nulls":4},10,null,10,15,null,null,10,10,null,10,12,12,12,10,null,10,{"$nulls":27},131]
[49,"BOUGLAINVAL","FABRY Emmanuel",8,"HVS",null,25,null,22,{"$nulls":4},10,null,15,{"$nulls":3},15,14,null,null,14,15,{"$nulls":28},130]
[50,"CHARPONT","TOULOUSE Louis",8,"HAD",null,null,10,null,null,30,null,25,{"$nulls":6},15,null,15,15,10,null,10,{"$nulls":27},130]
[51,"BOUGLAINVAL","CHARTIER Bernard",11,"HVS",null,25,10,12,10,{"$nulls":3},10,null,null,12,{"$nulls":3},10,null,10,10,10,10,{"$nulls":27},129]
[52,"BOULES CLUB CLOYSIEN","LALLIOT Gildas",8,"HAS",20,null,10,null,12,{"$nulls":5},10,null,15,null,22,null,10,null,30,{"$nulls":29},129]
[53,"LURAY","ROSSIGNOL Pascal",10,"HVS",30,12,12,{"$nulls":5},10,null,null,10,null,null,10,10,10,null,15,null,10,{"$nulls":27},129]
[54,"BLEVY MAILLEBOIS","VAZQUEZ Baptiste",8,"HAS",null,20,16,null,null,10,{"$nulls":5},20,{"$nulls":3},10,10,null,null,30,12,{"$nulls":27},128]
[55,"CRECY- COUVE","TACHAT Bruno",10,"HVD",null,15,{"$nulls":3},20,null,12,10,null,10,{"$nulls":4},10,10,null,10,16,15,{"$nulls":27},128]
[56,"SAINT ELIPH","HARDY Aurelien",9,"HAS",12,{"$nulls":7},22,null,14,10,null,null,20,10,15,15,10,{"$nulls":29},128]
[57,"CHARPONT","JOSSE Marcel",11,"HVS",null,10,12,10,10,15,null,18,{"$nulls":6},10,12,null,null,10,10,10,{"$nulls":27},127]
[58,"LURAY","BAZEMONT Bruno",10,"HAD",null,22,10,10,{"$nulls":4},10,null,null,10,null,null,10,10,10,null,12,null,22,{"$nulls":27},126]
{"$rows_left_out":570}
{"sheet":"classement club","index":2,"n_rows":17,"n_cols":9,"rows_kept":17}
[null,null,"points club","nombre de licenciés club","Index coul"]
[1,"Luray",{"$f":"SUMIF(Club!BC3:BC662,12,Club!BB3:BB662)","v":{"v":5372,"d":"5,372"}},{"$f":"COUNTIF(Club!BC3:BC662,12)","v":59},47,{"$f":"NumCouleur(#REF!)","v":{"$error":"#VALUE!"}},null,"Total de licenciés",{"$f":"SUM(D2:D18)","v":627}]
[2,"Charpont",{"$f":"SUMIF(Club!BC3:BC662,6,Club!BB3:BB662)","v":{"v":4756,"d":"4,756"}},{"$f":"COUNTIF(Club!BC3:BC662,6)","v":82},50,{"$f":"NumCouleur(B2)","v":{"$error":"#NAME?"}},null,"Total de points",{"$f":"SUM(C2:C18)","v":{"v":34946,"d":"34,946"}}]
[3,"Crécy Couvé",{"$f":"SUMIF(Club!BC3:BC662,9,Club!BB3:BB662)","v":{"v":4321,"d":"4,321"}},{"$f":"COUNTIF(Club!BC3:BC662,9)","v":48},5,{"$f":"NumCouleur(B4)","v":{"$error":"#NAME?"}}]
[4,"Bouglainval",{"$f":"SUMIF(Club!BC3:BC662,4,Club!BB3:BB662)","v":{"v":4304,"d":"4,304"}},{"$f":"COUNTIF(Club!BC3:BC662,4)","v":60},6,{"$f":"NumCouleur(B5)","v":{"$error":"#NAME?"}}]
[5,"Vichères",{"$f":"SUMIF(Club!BC3:BC662,15,Club!BB3:BB662)","v":{"v":4018,"d":"4,018"}},{"$f":"COUNTIF(Club!BC3:BC662,15)","v":46},43,{"$f":"NumCouleur(B6)","v":{"$error":"#NAME?"}}]
[6,"Boules Club Cloysien",{"$f":"SUMIF(Club!BC3:BC662,17,Club!BB3:BB662)","v":{"v":2322,"d":"2,322"}},{"$f":"COUNTIF(Club!BC4:BC662,17)","v":35},40,{"$f":"NumCouleur(B7)","v":{"$error":"#NAME?"}}]
[7,"Blévy-Maillebois",{"$f":"SUMIF(Club!BC3:BC662,2,Club!BB3:BB662)","v":{"v":1812,"d":"1,812"}},{"$f":"COUNTIF(Club!BC3:BC662,2)","v":33},14,{"$f":"NumCouleur(B8)","v":{"$error":"#NAME?"}}]
[8,"Challet Bailleau l'Evêque",{"$f":"SUMIF(Club!BC3:BC662,5,Club!BB3:BB662)","v":{"v":1554,"d":"1,554"}},{"$f":"COUNTIF(Club!BC3:BC662,5)","v":34},45,{"$f":"NumCouleur(B9)","v":{"$error":"#NAME?"}}]
[9,"St Georges Motel",{"$f":"SUMIF(Club!BC3:BC662,14,Club!BB3:BB662)","v":{"v":1529,"d":"1,529"}},{"$f":"COUNTIF(Club!BC3:BC662,14)","v":50},48,{"$f":"NumCouleur(B10)","v":{"$error":"#NAME?"}}]
[10,"St Eliph",{"$f":"SUMIF(Club!BC3:BC662,13,Club!BB3:BB662)","v":{"v":1296,"d":"1,296"}},{"$f":"COUNTIF(Club!BC4:BC663,13)","v":26},7,{"$f":"NumCouleur(B11)","v":{"$error":"#NAME?"}}]
[11,"La Gauloise",{"$f":"SUMIF(Club!BC3:BC662,11,Club!BB3:BB662)","v":952},{"$f":"COUNTIF(Club!BC3:BC662,11)","v":23},3,{"$f":"NumCouleur(B12)","v":{"$error":"#NAME?"}}]
[12,"Yèvres",{"$f":"SUMIF(Club!BC3:BC662,16,Club!BB3:BB662)","v":660},{"$f":"COUNTIF(Club!BC3:BC662,16)","v":27},33,{"$f":"NumCouleur(B13)","v":{"$error":"#NAME?"}}]
[13,"Gas",{"$f":"SUMIF(Club!BC3:BC662,10,Club!BB3:BB662)","v":612},{"$f":"COUNTIF(Club!BC3:BC662,10)","v":23},22,{"$f":"NumCouleur(B14)","v":{"$error":"#NAME?"}}]
[14,"Chuisnes",{"$f":"SUMIF(Club!BC3:BC662,8,Club!BB3:BB662)","v":563},{"$f":"COUNTIF(Club!BC3:BC662,8)","v":22},19,{"$f":"NumCouleur(B15)","v":{"$error":"#NAME?"}}]
[15,"Bonneval",{"$f":"SUMIF(Club!BC3:BC662,3,Club!BB3:BB662)","v":531},{"$f":"COUNTIF(Club!BC3:BC662,3)","v":18},37,{"$f":"NumCouleur(B16)","v":{"$error":"#NAME?"}}]
[16,"Cheminots",{"$f":"SUMIF(Club!BC3:BC662,7,Club!BB3:BB662)","v":344},{"$f":"COUNTIF(Club!BC3:BC662,7)","v":41}]

{"sheet":"Code couleur","index":3,"n_rows":56,"n_cols":10,"rows_kept":56,"hidden":true}
[{"$nulls":6},10]
[{"$nulls":6},10]
[{"$nulls":4},{"$f":"[1]!no_couleur(D3)","v":{"$error":"#NAME?"}},null,12,{"$f":"SUM(G1:G3)","v":32},3,{"$f":"H3*I3","v":96}]
[{"$nulls":6},12,null,null,0]
[null,{"$f":"NumCouleur(D5)","v":{"$error":"#NAME?"}},{"$nulls":4},10,null,null,0]
[{"$nulls":6},10,null,null,0]
[{"$nulls":6},10,null,null,0]
[{"$nulls":4},{"$f":"+'classement club'!#REF!","v":{"$error":"#REF!"}},null,10,null,null,0]
[{"$nulls":4},{"$f":"+'classement club'!C2","v":{"v":5372,"d":"5,372"}},null,10,null,null,0]
[{"$nulls":4},{"$f":"+'classement club'!C4","v":{"v":4321,"d":"4,321"}},null,25,{"$f":"SUM(G4:G10)","v":87},3,{"$f":"H10*I10","v":261}]
[{"$nulls":4},{"$f":"+'classement club'!C5","v":{"v":4304,"d":"4,304"}},null,15,null,null,{"$f":"H11*I11","v":0}]
[{"$nulls":4},{"$f":"+'classement club'!C6","v":{"v":4018,"d":"4,018"}},null,15,null,null,0]
[{"$nulls":4},{"$f":"+'classement club'!C7","v":{"v":2322,"d":"2,322"}},null,10,null,null,0]
[{"$nulls":4},{"$f":"+'classement club'!C8","v":{"v":1812,"d":"1,812"}},null,10,null,null,0]
[{"$nulls":4},{"$f":"+'classement club'!C9","v":{"v":1554,"d":"1,554"}},null,10,null,null,0]
[{"$nulls":4},{"$f":"+'classement club'!C10","v":{"v":1529,"d":"1,529"}},null,10,null,null,0]
[{"$nulls":4},{"$f":"+'classement club'!C11","v":{"v":1296,"d":"1,296"}},null,20,null,null,0]
[{"$nulls":4},{"$f":"+'classement club'!C12","v":952},null,10,null,null,0]
[{"$nulls":4},{"$f":"+'classement club'!C13","v":660},null,20]
[{"$nulls":4},{"$f":"'classement club'!C14","v":612},null,14,{"$f":"SUM(G11:G20)","v":134},3,{"$f":"H20*I20","v":402}]
[{"$nulls":4},{"$f":"+'classement club'!C15","v":563},null,16,null,null,{"$f":"H21*I21","v":0}]
[{"$nulls":4},{"$f":"+'classement club'!C16","v":531},null,10,null,null,0]
[{"$nulls":4},{"$f":"'classement club'!C17","v":344},null,10,null,null,0]
[{"$nulls":6},10,null,null,0]
[{"$nulls":6},15,null,null,0]
[{"$nulls":6},10,null,null,0]
[{"$nulls":4},{"$f":"SUM(E8:E23)","v":{"$error":"#REF!"}},{"$f":"F30+F29+F31","v":51585},15,null,null,0]
[{"$nulls":6},10,null,null,0]
[{"$nulls":5},50665,10,{"$f":"SUM(G21:G29)","v":106},3,318]
[{"$nulls":5},920,22]
[{"$nulls":5},0,12]
[{"$nulls":6},15]
[{"$nulls":5},{"$f":"F34*F35","v":2211},12]
[{"$nulls":5},3,12]
[{"$nulls":5},737,12]
[{"$nulls":6},10]
[{"$nulls":5},{"$f":"SUM(G1:G60)","v":687},10]
[{"$nulls":6},10]
[{"$nulls":6},10]
[{"$nulls":6},10]
[{"$nulls":6},10]
[{"$nulls":6},10]
[{"$nulls":6},10]
[{"$nulls":6},10]
[{"$nulls":6},10]
[{"$nulls":6},10]
[{"$nulls":6},30]
[{"$nulls":6},15]
[{"$nulls":6},18]
[{"$nulls":6},10]
[{"$nulls":6},10]
[{"$nulls":6},10]
[{"$nulls":6},10]
[{"$nulls":6},10]
[{"$nulls":6},10]
[{"$nulls":6},10]