{"text_format":"3","workbook":"xlsx","n_sheets":4,"sheets":["Club","Joueur","classement club","Code couleur"],"not_rendered":{"macros":1,"external_links":1,"defined_names":4},"read":"whole","date_system":"1900"}

{"sheet":"Club","index":0,"n_rows":644,"n_cols":36,"rows_kept":644,"merged":[[0,10,0,11],[0,13,0,14],[2,18,641,18]]}
[{"$nulls":5},"Chuisnes","B.O.C.","Crécy","Charpont","Bonneval","Luray",null,"Vichères","Challet - Bailleau",null,"Cloyes","St G.M.","Bonneval","Yèvres","St Eliph","Blévy M","Challet - B","Cloyes","Charpont","Chuisnes","Cheminots","Cheminots","B.O.C.","Ouarville","Luray","St G.M.","La Gauloise","Gas","TOTAL"]
[null,"Club","nom prénom","concours nbs",{"$f":"NumCouleur(D2)","v":{"$error":"#NAME?"}},"2024-09-01","2024-09-07","2024-09-08","2024-09-14","2024-09-15","21/09/2024   TRI","21/09/2024         DM","22/09/2024    QUA","28/09/2024   TRI","28/09/2024         DF","2024-09-29","2024-10-05","2024-10-06","2024-10-12","2024-10-13","2024-10-19","2024-10-20","2024-10-26","2024-10-27","2024-11-02","2024-11-03","2024-11-09","2024-11-10","2024-11-16","2024-11-17","2024-11-23","2024-11-24","2024-11-30","individuel"]
[1,"BLEVY MAILLEBOIS","BIDARD Philippe",{"$f":"COUNTIF(F3:AG3,\">1\")","v":10},"HVS",{"$nulls":13},"ANNULÉ",12,15,10,null,10,10,10,10,10,null,10,null,10,null,{"$f":"SUM(F3:AG3)","v":107},2]
[2,"BLEVY MAILLEBOIS","BOULAY Christophe",0,"HAD",{"$nulls":28},0,2]
[3,"BLEVY MAILLEBOIS","BRETAGNE Fabien",1,"HAS",{"$nulls":15},10,{"$nulls":12},10,2]
[4,"BLEVY MAILLEBOIS","BURSON Anthony",4,"HAS",{"$nulls":3},12,{"$nulls":7},12,{"$nulls":3},10,{"$nulls":8},12,{"$nulls":3},46,2]
[5,"BLEVY MAILLEBOIS","DUFOSSE Anthony",2,"HAS",{"$nulls":15},10,{"$nulls":5},10,{"$nulls":6},20,2]
[6,"BLEVY MAILLEBOIS","FREMONT Benoît",19,"HVS",22,20,16,30,null,10,null,null,10,null,null,20,null,null,15,10,10,null,null,30,12,20,10,15,10,15,10,10,295,2]
[7,"BLEVY MAILLEBOIS","FREMONT Denis",13,"HVS",null,null,12,10,null,10,null,null,10,null,null,16,null,null,15,{"$nulls":3},10,10,10,10,null,null,15,10,null,20,158,2]
[8,"BLEVY MAILLEBOIS","FREMONT Stéphane",19,"HAS",22,20,16,30,null,10,null,null,10,null,null,20,null,null,15,10,10,null,null,30,12,20,10,15,10,15,10,10,295,2]
[9,"BLEVY MAILLEBOIS","GAJAS Gaspard",0,"HAS",{"$nulls":28},0,2]
[10,"BLEVY MAILLEBOIS","GAUTIER Laurent",8,"HVS",{"$nulls":14},10,10,10,null,10,10,null,null,10,null,10,null,10,null,80,2]
[11,"BLEVY MAILLEBOIS","GILLOT Julien",4,"HAS",{"$nulls":3},12,{"$nulls":10},10,10,{"$nulls":8},12,{"$nulls":3},44,2]
[12,"BLEVY MAILLEBOIS","GILLOT Moïse",12,"HVS",null,null,12,10,null,10,null,null,10,null,null,16,null,null,15,{"$nulls":3},10,10,10,10,null,null,15,null,null,20,148,2]
[13,"BLEVY MAILLEBOIS","GLOTIN Julien",1,"HAS",{"$nulls":11},12,{"$nulls":16},12,2]
[14,"BLEVY MAILLEBOIS","GREVIN Kaëlig",1,"HJS",{"$nulls":11},12,{"$nulls":16},12,2]
[15,"BLEVY MAILLEBOIS","GREVIN Michel",16,"HVS",null,10,10,10,{"$nulls":4},10,null,null,12,null,null,10,15,10,null,10,12,10,10,10,null,10,10,10,null,169,2]
[16,"BLEVY MAILLEBOIS","GUGGENBUHL Claude",6,"HVS",{"$nulls":3},10,{"$nulls":6},10,{"$nulls":4},10,{"$nulls":5},10,{"$nulls":3},10,10,null,60,2]
[17,"BLEVY MAILLEBOIS","HANDZICH Maryse",4,"FVS",{"$nulls":15},10,10,null,10,12,{"$nulls":8},42,2]
[18,"BLEVY MAILLEBOIS","JURE Eric",7,"HVS",{"$nulls":8},10,null,null,16,null,null,15,{"$nulls":3},10,{"$nulls":5},15,15,null,20,101,2]
[19,"BLEVY MAILLEBOIS","LARHANTEC Louis",3,"HVS",null,10,{"$nulls":6},10,{"$nulls":6},30,{"$nulls":12},50,2]
[20,"BLEVY MAILLEBOIS","LAUVRAY Raymonde",5,"FVD",{"$nulls":15},10,10,null,10,10,{"$nulls":4},10,{"$nulls":3},50,2]
[21,"BLEVY MAILLEBOIS","LEMAIRE Raphael",7,"HAS",null,null,10,10,{"$nulls":4},10,{"$nulls":5},10,{"$nulls":3},10,null,null,10,{"$nulls":3},10,null,null,70,2]
[22,"BLEVY MAILLEBOIS","MACHADO Federico",7,"HVD",{"$nulls":14},10,10,10,null,10,{"$nulls":3},10,null,10,null,10,null,70,2]
[23,"BLEVY MAILLEBOIS","MAIA Christophe",14,"HAS",null,null,12,12,null,10,null,null,10,null,null,12,null,null,10,10,null,null,10,10,10,10,null,null,12,10,null,10,148,2]
[24,"BLEVY MAILLEBOIS","MARTIN Antoine",1,"HAS",{"$nulls":15},10,{"$nulls":12},10,2]
[25,"BLEVY MAILLEBOIS","MARTIN Eric",9,"HVS",null,10,10,{"$nulls":5},10,null,null,12,null,null,12,30,10,null,null,12,10,{"$nulls":7},116,2]
[26,"BLEVY MAILLEBOIS","MARTIN Gaëtan",6,"HAS",null,null,10,{"$nulls":5},10,{"$nulls":5},12,30,10,{"$nulls":3},10,{"$nulls":7},82,2]
[27,"BLEVY MAILLEBOIS","MARTIN Pierre",5,"HAS",null,null,10,{"$nulls":13},10,{"$nulls":3},10,20,{"$nulls":3},10,null,null,60,2]
[28,"BLEVY MAILLEBOIS","MOREAU Baptiste",5,"HAS",{"$nulls":3},10,{"$nulls":6},10,{"$nulls":10},10,null,null,10,null,10,null,50,2]
[29,"BLEVY MAILLEBOIS","MORIN Anthony",0,"HAS",{"$nulls":28},0,2]
[30,"BLEVY MAILLEBOIS","SMIESCZAK Thibaut",3,"HAS",null,null,10,{"$nulls":12},15,{"$nulls":4},10,{"$nulls":7},35,2]
[31,"BLEVY MAILLEBOIS","TROUILLET Baptiste",0,"HAS",{"$nulls":28},0,2]
[32,"BLEVY MAILLEBOIS","VAZQUEZ Baptiste",11,"HAS",null,20,16,null,null,10,{"$nulls":5},20,{"$nulls":3},10,10,null,null,30,12,null,null,15,10,null,null,10,163,2]
[33,"BLEVY MAILLEBOIS","WEISS Julien",2,"HAS",{"$nulls":8},10,{"$nulls":6},10,{"$nulls":12},20,2,{"$f":"SUM(AH3:AH35)","v":2523}]
[34,"BONNEVAL","BEDOT Frédéric",3,"HVS",{"$nulls":4},14,{"$nulls":5},10,{"$nulls":6},15,{"$nulls":10},39,3]
[35,"BONNEVAL","BEDOT Marie Claire",0,"FVS",{"$nulls":28},0,3]
[36,"BONNEVAL","BOUILLY Eric",8,"HVS",{"$nulls":4},15,{"$nulls":5},10,{"$nulls":4},10,null,15,null,10,{"$nulls":3},25,null,null,10,12,107,3]
[37,"BONNEVAL","BRETON Gilbert",2,"HVD",{"$nulls":4},14,{"$nulls":5},10,{"$nulls":17},24,3]
[38,"BONNEVAL","BRETON Patricia",1,"FVD",{"$nulls":10},10,{"$nulls":17},10,3]
[39,"BONNEVAL","COUDRAY Sylvain",3,"HAD",{"$nulls":12},10,{"$nulls":6},10,{"$nulls":3},10,{"$nulls":4},30,3]
[40,"BONNEVAL","COURTOIS Victor",2,"HJS",{"$nulls":4},14,{"$nulls":5},10,{"$nulls":17},24,3]
[41,"BONNEVAL","DUVIGNEAU Jean François",2,"HVD",{"$nulls":20},12,null,null,10,{"$nulls":4},22,3]
[42,"BONNEVAL","FAVRÉ Mickael",5,"HAD",{"$nulls":4},16,{"$nulls":7},15,{"$nulls":10},16,null,null,10,12,69,3]
[43,"BONNEVAL","GALLAIS Janny",6,"HVD",{"$nulls":4},10,{"$nulls":7},10,{"$nulls":4},10,null,10,{"$nulls":3},10,{"$nulls":3},12,62,3]
[44,"BONNEVAL","LACOSTE Phillippe",9,"HVD",{"$nulls":4},15,{"$nulls":5},10,null,15,null,null,10,null,15,null,10,{"$nulls":3},25,null,null,10,12,122,3]
[45,"BONNEVAL","LINGET Martine",4,"FVS",{"$nulls":10},10,null,10,{"$nulls":4},10,{"$nulls":5},10,{"$nulls":4},40,3]
[46,"BONNEVAL","MATHIEU Maxime",2,"HAS",{"$nulls":4},16,{"$nulls":18},16,{"$nulls":4},32,3]
[47,"BONNEVAL","MAUGET Bruno",5,"HVS",{"$nulls":4},15,{"$nulls":10},10,{"$nulls":3},10,{"$nulls":3},25,{"$nulls":3},12,72,3]
[48,"BONNEVAL","PERRICHOT Denis",2,"HVS",{"$nulls":12},15,{"$nulls":7},12,{"$nulls":7},27,3]
[49,"BONNEVAL","THOMAS Eric",4,"HVD",{"$nulls":12},10,{"$nulls":6},10,12,null,null,10,{"$nulls":4},42,3]
[50,"BONNEVAL","VAUGLIN Marcel",5,"HVD",{"$nulls":4},10,{"$nulls":5},10,null,10,{"$nulls":4},10,{"$nulls":5},10,{"$nulls":4},50,3]
[51,"BONNEVAL","VINCENZI Sylvain",4,"HVS",{"$nulls":4},16,{"$nulls":18},16,null,null,10,12,54,3,{"$f":"SUM(AH36:AH53)","v":826}]
[52,"BOUGLAINVAL","ALLOUIS Corentin",18,"HAD",10,15,18,10,10,15,null,10,10,null,10,10,18,null,15,{"$nulls":3},10,null,20,null,null,20,10,10,12,null,233,4]
[53,"BOUGLAINVAL","ALLOUIS Stéphane",14,"HVS",20,18,null,12,null,15,null,10,10,{"$nulls":5},15,{"$nulls":3},10,null,10,null,12,20,22,14,10,null,198,4]
[54,"BOUGLAINVAL","BATAYER Gilberte",0,"FVS",{"$nulls":28},0,4]
[55,"BOUGLAINVAL","BATAYER Yves",0,"HVS",{"$nulls":28},0,4]
[56,"BOUGLAINVAL","BOILLOD Sylvain",9,"HVS",null,10,{"$nulls":3},12,null,null,10,null,null,10,{"$nulls":3},15,null,null,10,10,null,10,{"$nulls":5},10,97,4]
[57,"BOUGLAINVAL","BREMAUD André",5,"HVD",null,null,10,null,null,12,{"$nulls":9},10,10,{"$nulls":10},15,57,4]
[58,"BOUGLAINVAL","CANALES Corinne",3,"FVD",{"$nulls":24},25,15,null,16,56,4]
{"$rows_left_out":585}
{"sheet":"Joueur","index":1,"n_rows":642,"n_cols":34,"rows_kept":642,"merged":[[0,10,0,11],[0,13,0,14]]}
[{"$nulls":5},"Chuisnes","B.O.C.","Crécy","Charpont","Bonneval","Luray",null,"Vichères","Challet - Bailleau",null,"Cloyes","St G.M.","Bonneval","Yèvres","St Eliph","Blévy M","Challet - B","Cloyes","Charpont","Chuisnes","Cheminots","Cheminots","B.O.C.","Ouarville","Luray","St G.M.","La Gauloise","Gas","TOTAL"]
[null,"Club","nom prénom","concours nbs",{"$f":"NumCouleur(D2)","v":{"$error":"#NAME?"}},"2024-09-01","2024-09-07","2024-09-08","2024-09-14","2024-09-15","21/09/2024   TRI","21/09/2024         DM","22/09/2024    QUA","28/09/2024   TRI","28/09/2024         DF","2024-09-29","2024-10-05","2024-10-06","2024-10-12","2024-10-13","2024-10-19","2024-10-20","2024-10-26","2024-10-27","2024-11-02","2024-11-03","2024-11-09","2024-11-10","2024-11-16","2024-11-17","2024-11-23","2024-11-24","2024-11-30","individuel"]
[1,"VICHERES","BROZILLE Benoît",{"$f":"COUNTIF(F3:AG3,\">1\")","v":22},"HAS",10,null,22,10,null,null,18,30,20,null,15,null,15,null,18,15,10,15,10,15,15,15,10,18,10,12,20,22,{"$f":"SUM(F3:AG3)","v":345}]
[2,"CRECY- COUVE","LE HELLEY Marcel",19,"HVS",10,15,15,null,null,10,null,10,{"$nulls":3},22,22,null,10,10,10,null,20,10,30,20,15,null,20,20,15,30,314]
[3,"CRECY- COUVE","COLOMBEL Jean François",15,"HVD",null,15,15,25,null,null,30,null,25,null,null,15,null,null,30,null,25,null,25,10,30,10,10,null,18,30,null,null,313]
[4,"CRECY- COUVE","BROU David",20,"HAD",15,15,30,null,null,15,null,10,15,null,null,10,22,null,10,10,10,null,22,10,10,10,15,null,30,20,10,15,304]
[5,"BLEVY MAILLEBOIS","FREMONT Benoît",19,"HVS",22,20,16,30,null,10,null,null,10,null,null,20,null,null,15,10,10,null,null,30,12,20,10,15,10,15,10,10,295]
[6,"BLEVY MAILLEBOIS","FREMONT Stéphane",19,"HAS",22,20,16,30,null,10,null,null,10,null,null,20,null,null,15,10,10,null,null,30,12,20,10,15,10,15,10,10,295]
[7,"LURAY","POIRIER Philippe",19,"HAS",15,30,10,null,30,12,null,10,null,null,15,null,20,null,15,20,10,null,10,10,null,10,10,null,20,10,10,18,285]
[8,"BOUGLAINVAL","LE BRIS Fabrice",22,"HVS",15,18,null,null,10,15,null,10,10,null,12,14,null,null,10,25,10,10,10,10,10,10,12,20,22,10,10,10,283]
[9,"CHARPONT","CEULEMANS Cédric",19,"HAS",null,10,10,null,null,30,null,25,10,null,null,10,null,null,15,10,15,12,10,20,10,22,15,null,10,15,22,12,283]
[10,"VICHERES","GIRARD Laurent",18,"HAS",10,15,22,null,null,15,null,30,10,{"$nulls":3},10,null,10,20,null,12,10,18,10,15,12,null,10,12,null,22,263]
[11,"CRECY- COUVE","GOSNET Franck",14,"HAD",null,15,null,25,null,20,null,15,25,null,10,15,null,null,30,{"$nulls":3},25,null,null,10,10,null,18,30,null,10,258]
[12,"BOUGLAINVAL","LOREILLER Bruno",18,"HVD",10,null,10,10,null,12,null,16,10,null,null,10,null,null,15,25,12,null,10,25,null,10,10,20,22,12,null,15,254]
[13,"VICHERES","LEBOSSE Brice",15,"HAS",null,null,22,{"$nulls":4},10,30,null,15,null,14,null,20,15,null,15,10,20,10,14,25,null,10,null,20,null,250]
[14,"LURAY","MARECHAL Maxime",18,"HAS",10,null,10,10,12,10,null,12,15,null,25,null,20,null,12,20,20,18,10,10,10,15,10,{"$nulls":5},249]
[15,"VICHERES","PODWOJEWSKI Patrice",17,"HVD",{"$nulls":3},20,{"$nulls":3},22,10,null,20,null,30,null,10,20,null,12,10,12,10,null,10,18,10,10,12,10,246]
[16,"LURAY","VALLEE Louis",17,"HAS",15,30,10,null,null,12,null,10,20,null,10,null,20,null,15,20,10,null,10,15,10,{"$nulls":3},10,null,10,18,245]
[17,"CRECY- COUVE","LE MEUR Yoan",18,"HAS",10,15,20,10,null,15,null,null,15,null,null,22,null,null,10,10,12,null,12,10,10,10,15,null,20,null,10,15,241]
[18,"LURAY","BURSON Ghislaine",18,"FAS",10,null,12,12,15,null,10,12,null,20,15,{"$nulls":4},15,20,null,10,10,14,15,10,null,10,12,null,18,240]
[19,"CRECY- COUVE","TACHAT Bruno",16,"HVD",null,15,{"$nulls":3},20,null,12,10,null,10,{"$nulls":4},10,10,null,10,16,15,15,15,null,10,22,18,30,238]
[20,"BOUGLAINVAL","ALLOUIS Corentin",18,"HAD",10,15,18,10,10,15,null,10,10,null,10,10,18,null,15,{"$nulls":3},10,null,20,null,null,20,10,10,12,null,233]
[21,"SAINT GEORGES MOTEL","POINÇON Stéphane",12,"HA",{"$nulls":3},12,null,22,{"$nulls":5},20,{"$nulls":4},18,null,10,22,15,25,30,null,12,25,null,20,231]
[22,"LURAY","ROULEAU Jean-Charles",18,"HVS",30,12,12,12,12,10,null,10,12,null,15,{"$nulls":3},10,10,null,null,15,15,10,null,10,null,10,10,null,14,229]
[23,"VICHERES","SAGOT Didier",17,"HVS",18,null,12,10,18,{"$nulls":3},10,null,10,null,30,null,20,null,10,12,10,12,10,10,10,null,10,null,null,15,227]
[24,"LURAY","LIGAVAN Karine",16,"FAS",10,null,12,10,30,10,null,20,null,20,10,null,15,null,12,15,10,10,null,null,14,12,10,{"$nulls":5},220]
[25,"CRECY- COUVE","PIREAULT Christian",14,"HVD",15,null,15,{"$nulls":4},12,10,{"$nulls":5},12,10,null,null,20,16,10,15,15,null,16,22,null,30,218]
[26,"CHARPONT","DELAMARE Hervé",19,"HVD",10,{"$nulls":4},10,null,10,15,null,null,10,10,null,10,12,12,12,10,null,10,10,10,15,12,10,14,10,212]
[27,"LURAY","BURSON Denis",15,"HVS",10,10,10,10,30,10,null,20,15,null,20,{"$nulls":4},10,{"$nulls":5},15,10,null,10,18,null,10,208]
[28,"CHARPONT","JOSSE Marcel",18,"HVS",null,10,12,10,10,15,null,18,{"$nulls":6},10,12,null,null,10,10,10,10,10,15,10,12,10,10,204]
[29,"CRECY- COUVE","GASSE MARGAT Jacky",13,"HVD",{"$nulls":3},15,null,20,null,null,10,{"$nulls":6},10,null,null,22,15,15,15,15,null,25,20,10,12,204]
[30,"CHARPONT","BOUVIER Carl",18,"HVS",15,10,10,10,null,10,null,12,15,{"$nulls":5},10,10,10,null,10,10,10,null,10,null,12,10,10,15,199]
[31,"CHARPONT","JOSSE Marie Helene",17,"FVS",null,16,10,10,10,null,16,10,{"$nulls":7},10,null,null,10,10,10,22,10,10,10,15,10,10,199]
[32,"BOUGLAINVAL","ALLOUIS Stéphane",14,"HVS",20,18,null,12,null,15,null,10,10,{"$nulls":5},15,{"$nulls":3},10,null,10,null,12,20,22,14,10,null,198]
[33,"LURAY","MARCHIORI Joel",16,"HVS",30,10,10,15,10,12,null,10,12,null,15,10,{"$nulls":3},10,null,null,10,12,10,{"$nulls":3},10,null,null,12,198]
[34,"CHARPONT","LAUVRAY sébastien",18,"HAS",15,14,10,10,null,null,16,10,10,{"$nulls":5},10,10,10,null,10,10,null,10,10,10,12,10,10,null,197]
[35,"LURAY","LIGAVAN Philippe",14,"HVD",10,10,15,10,15,null,null,20,null,null,20,15,15,null,25,null,null,10,null,10,{"$nulls":4},10,12,null,null,197]
[36,"BOUGLAINVAL","MARTIN Gérard",16,"HVD",20,12,null,null,10,10,null,10,10,null,10,{"$nulls":4},15,14,null,10,null,20,null,10,15,10,null,10,10,196]
[37,"BOULES CLUB CLOYSIEN","MAURICE Marc",15,"HVS",{"$nulls":4},20,null,null,12,14,null,12,10,null,null,10,22,14,22,10,10,10,null,10,null,10,null,10,null,196]
[38,"CRECY- COUVE","LANOE Christophe",15,"HVD",15,15,15,10,null,10,null,15,10,null,15,10,null,null,10,{"$nulls":3},10,{"$nulls":3},15,null,15,null,15,15,195]
[39,"VICHERES","BRISSONNET Angelique",16,"FAS",null,10,10,null,null,15,null,10,{"$nulls":4},15,null,10,15,null,12,10,18,10,15,12,null,10,12,null,10,194]
[40,"CHARPONT","NICHOLAS Thierry",17,"HVS",10,10,10,10,null,10,null,18,10,{"$nulls":6},10,10,null,15,20,10,null,10,null,10,10,10,10,193]
[41,"LURAY","PAPIN Jasmine",15,"FVD",15,10,15,10,null,null,25,10,null,16,10,{"$nulls":4},10,null,null,18,12,10,null,10,null,10,null,null,10,191]
[42,"VICHERES","LETOURNEUR Christian",14,"HVS",10,null,15,10,15,null,null,15,15,{"$nulls":3},15,null,12,null,10,20,null,15,null,null,10,{"$nulls":3},12,15,189]
[43,"LURAY","SORTAIS Luc",15,"HVS",15,12,null,10,{"$nulls":4},12,null,null,10,null,null,10,18,10,18,12,10,10,12,null,null,15,10,null,null,184]
[44,"CHARPONT","TOULOUSE Louis",12,"HAD",null,null,10,null,null,30,null,25,{"$nulls":6},15,null,15,15,10,null,10,22,null,null,10,10,10,null,182]
[45,"CHARPONT","JEANNOT Lucie",15,"FAS",null,10,10,{"$nulls":3},14,25,null,15,{"$nulls":4},10,10,15,null,10,10,10,null,10,null,null,12,10,10,181]
[46,"BOULES CLUB CLOYSIEN","PATEYRON Michel",15,"HVS",{"$nulls":4},20,null,null,12,null,null,12,10,10,null,10,22,14,null,10,10,10,null,10,null,10,null,10,10,180]
[47,"BOUGLAINVAL","CHARTIER Bernard",15,"HVS",null,25,10,12,10,{"$nulls":3},10,null,null,12,{"$nulls":3},10,null,10,10,10,10,null,10,15,null,14,10,null,178]
[48,"BOUGLAINVAL","COUELLAUD Walter",16,"HAS",null,10,null,10,10,10,null,10,10,null,10,10,null,null,10,null,10,10,10,25,{"$nulls":4},10,10,12,null,177]
[49,"LURAY","BOUDVIN Jérome",16,"HAS",10,12,10,10,null,null,10,null,10,null,null,10,null,null,10,10,20,null,15,null,10,10,10,null,10,null,10,null,177]
[50,"BOUGLAINVAL","MARTIN Nadine",15,"FVD",10,10,null,null,10,10,null,10,null,15,10,{"$nulls":4},15,null,null,10,null,20,null,10,15,10,null,10,10,175]
[51,"CHARPONT","ROUSSEAU Patrick",13,"HVS",null,12,null,15,20,{"$nulls":3},16,null,10,{"$nulls":7},10,10,15,15,10,null,15,15,12,null,175]
[52,"LURAY","GLIZE Elisabheth",13,"FVD",null,null,15,10,{"$nulls":5},18,10,{"$nulls":3},10,10,null,null,10,12,14,30,10,null,10,null,null,14,173]
[53,"VICHERES","ESCULIER Christian",12,"HVS",10,null,12,20,{"$nulls":3},15,30,null,10,{"$nulls":3},10,null,10,null,null,18,15,null,12,null,10,{"$nulls":3},172]
[54,"CRECY- COUVE","LE HELLEY Kevin",12,"HAS",10,{"$nulls":4},14,{"$nulls":5},10,22,null,10,null,12,null,12,10,10,20,null,null,30,null,10,null,170]
[55,"BLEVY MAILLEBOIS","GREVIN Michel",16,"HVS",null,10,10,10,{"$nulls":4},10,null,null,12,null,null,10,15,10,null,10,12,10,10,10,null,10,10,10,null,169]
[56,"SAINT ELIPH","LOMBARD Richard",15,"HAD",12,null,10,10,{"$nulls":7},10,20,null,10,10,12,10,10,null,10,null,10,12,10,null,12,null,168]
[57,"CHARPONT","DELAHAYE Mickael",13,"HAS",15,14,null,10,null,null,14,null,10,null,null,15,{"$nulls":4},15,null,10,20,null,null,10,null,10,12,null,12,167]
[58,"CHARPONT","PITOT Cédric",15,"HAD",null,10,10,10,null,null,10,12,{"$nulls":8},15,15,10,10,10,null,15,null,10,10,10,10,167]
{"$rows_left_out":583}
{"sheet":"classement club","index":2,"n_rows":18,"n_cols":9,"rows_kept":18}
[null,null,"points club","nombre de licenciés club","Index coul"]
[1,"Luray",{"$f":"SUMIF(Club!AI3:AI675,12,Club!AH3:AH675)","v":{"v":6808,"d":"6,808"}},{"$f":"COUNTIF(Club!AI3:AI675,12)","v":59},47,{"$f":"NumCouleur(#REF!)","v":{"$error":"#VALUE!"}},null,"Total de licenciés",{"$f":"SUM(D2:D19)","v":640}]
[2,"Charpont",{"$f":"SUMIF(Club!AI3:AI675,6,Club!AH3:AH675)","v":{"v":6642,"d":"6,642"}},{"$f":"COUNTIF(Club!AI3:AI675,6)","v":82},50,{"$f":"NumCouleur(B2)","v":{"$error":"#NAME?"}},null,"Total de points",{"$f":"SUM(C2:C19)","v":{"v":47688,"d":"47,688"}}]
[3,"Bouglainval",{"$f":"SUMIF(Club!AI3:AI675,4,Club!AH3:AH675)","v":{"v":5857,"d":"5,857"}},{"$f":"COUNTIF(Club!AI3:AI675,4)","v":62},5,{"$f":"NumCouleur(B4)","v":{"$error":"#NAME?"}}]
[4,"Crécy Couvé",{"$f":"SUMIF(Club!AI3:AI675,9,Club!AH3:AH675)","v":{"v":5835,"d":"5,835"}},{"$f":"COUNTIF(Club!AI3:AI675,9)","v":48},6,{"$f":"NumCouleur(B5)","v":{"$error":"#NAME?"}}]
[5,"Vichères",{"$f":"SUMIF(Club!AI3:AI675,15,Club!AH3:AH675)","v":{"v":5096,"d":"5,096"}},{"$f":"COUNTIF(Club!AI3:AI675,15)","v":46},43,{"$f":"NumCouleur(B6)","v":{"$error":"#NAME?"}}]
[6,"Boules Club Cloysien",{"$f":"SUMIF(Club!AI3:AI675,17,Club!AH3:AH675)","v":{"v":2822,"d":"2,822"}},{"$f":"COUNTIF(Club!AI4:AI675,17)","v":35},40,{"$f":"NumCouleur(B7)","v":{"$error":"#NAME?"}}]
[7,"St Georges Motel",{"$f":"SUMIF(Club!AI3:AI675,14,Club!AH3:AH675)","v":{"v":2533,"d":"2,533"}},{"$f":"COUNTIF(Club!AI3:AI675,14)","v":50},14,{"$f":"NumCouleur(B8)","v":{"$error":"#NAME?"}}]
[8,"Blévy-Maillebois",{"$f":"SUMIF(Club!AI3:AI675,2,Club!AH3:AH675)","v":{"v":2523,"d":"2,523"}},{"$f":"COUNTIF(Club!AI3:AI675,2)","v":33},45,{"$f":"NumCouleur(B9)","v":{"$error":"#NAME?"}}]
[9,"Challet Bailleau l'Evêque",{"$f":"SUMIF(Club!AI3:AI675,5,Club!AH3:AH675)","v":{"v":2008,"d":"2,008"}},{"$f":"COUNTIF(Club!AI3:AI675,5)","v":35},48,{"$f":"NumCouleur(B10)","v":{"$error":"#NAME?"}}]
[10,"St Eliph",{"$f":"SUMIF(Club!AI3:AI675,13,Club!AH3:AH675)","v":{"v":1566,"d":"1,566"}},{"$f":"COUNTIF(Club!AI4:AI676,13)","v":26},7,{"$f":"NumCouleur(B11)","v":{"$error":"#NAME?"}}]
[11,"La Gauloise",{"$f":"SUMIF(Club!AI3:AI675,11,Club!AH3:AH675)","v":{"v":1468,"d":"1,468"}},{"$f":"COUNTIF(Club!AI3:AI675,11)","v":23},3,{"$f":"NumCouleur(B12)","v":{"$error":"#NAME?"}}]
[12,"Yèvres",{"$f":"SUMIF(Club!AI3:AI675,16,Club!AH3:AH675)","v":{"v":1086,"d":"1,086"}},{"$f":"COUNTIF(Club!AI3:AI675,16)","v":27},33,{"$f":"NumCouleur(B13)","v":{"$error":"#NAME?"}}]
[13,"Gas",{"$f":"SUMIF(Club!AI3:AI675,10,Club!AH3:AH675)","v":{"v":1040,"d":"1,040"}},{"$f":"COUNTIF(Club!AI3:AI675,10)","v":23}]
[14,"Chuisnes",{"$f":"SUMIF(Club!AI3:AI675,8,Club!AH3:AH675)","v":957},{"$f":"COUNTIF(Club!AI3:AI675,8)","v":22},22,{"$f":"NumCouleur(B15)","v":{"$error":"#NAME?"}}]
[15,"Bonneval",{"$f":"SUMIF(Club!AI3:AI675,3,Club!AH3:AH675)","v":826},{"$f":"COUNTIF(Club!AI3:AI675,3)","v":18},19,{"$f":"NumCouleur(B16)","v":{"$error":"#NAME?"}}]
[16,"Cheminots",{"$f":"SUMIF(Club!AI3:AI675,7,Club!AH3:AH675)","v":474},{"$f":"COUNTIF(Club!AI3:AI675,7)","v":41},37,{"$f":"NumCouleur(B17)","v":{"$error":"#NAME?"}}]
[17,"Ouarville Pétanque",{"$f":"SUMIF(Club!AI4:AI676,18,Club!AH4:AH676)","v":147},{"$f":"COUNTIF(Club!AI4:AI676,18)","v":10}]

{"sheet":"Code couleur","index":3,"n_rows":56,"n_cols":10,"rows_kept":56,"hidden":true}
[{"$nulls":6},10]
[{"$nulls":6},10]
[{"$nulls":4},{"$f":"[1]!no_couleur(D3)","v":{"$error":"#NAME?"}},null,12,{"$f":"SUM(G1:G3)","v":32},3,{"$f":"H3*I3","v":96}]
[{"$nulls":6},12,null,null,0]
[null,{"$f":"NumCouleur(D5)","v":{"$error":"#NAME?"}},{"$nulls":4},10,null,null,0]
[{"$nulls":6},10,null,null,0]
[{"$nulls":6},10,null,null,0]
[{"$nulls":4},{"$f":"+'classement club'!#REF!","v":{"$error":"#REF!"}},null,10,null,null,0]
[{"$nulls":4},{"$f":"+'classement club'!C2","v":{"v":6808,"d":"6,808"}},null,10,null,null,0]
[{"$nulls":4},{"$f":"+'classement club'!C4","v":{"v":5857,"d":"5,857"}},null,25,{"$f":"SUM(G4:G10)","v":87},3,{"$f":"H10*I10","v":261}]
[{"$nulls":4},{"$f":"+'classement club'!C5","v":{"v":5835,"d":"5,835"}},null,15,null,null,{"$f":"H11*I11","v":0}]
[{"$nulls":4},{"$f":"+'classement club'!C6","v":{"v":5096,"d":"5,096"}},null,15,null,null,0]
[{"$nulls":4},{"$f":"+'classement club'!C7","v":{"v":2822,"d":"2,822"}},null,10,null,null,0]
[{"$nulls":4},{"$f":"+'classement club'!C8","v":{"v":2533,"d":"2,533"}},null,10,null,null,0]
[{"$nulls":4},{"$f":"+'classement club'!C9","v":{"v":2523,"d":"2,523"}},null,10,null,null,0]
[{"$nulls":4},{"$f":"+'classement club'!C10","v":{"v":2008,"d":"2,008"}},null,10,null,null,0]
[{"$nulls":4},{"$f":"+'classement club'!C11","v":{"v":1566,"d":"1,566"}},null,20,null,null,0]
[{"$nulls":4},{"$f":"+'classement club'!C12","v":{"v":1468,"d":"1,468"}},null,10,null,null,0]
[{"$nulls":4},{"$f":"+'classement club'!C13","v":{"v":1086,"d":"1,086"}},null,20]
[{"$nulls":4},{"$f":"'classement club'!C15","v":957},null,14,{"$f":"SUM(G11:G20)","v":134},3,{"$f":"H20*I20","v":402}]
[{"$nulls":4},{"$f":"+'classement club'!C16","v":826},null,16,null,null,{"$f":"H21*I21","v":0}]
[{"$nulls":4},{"$f":"+'classement club'!C17","v":474},null,10,null,null,0]
[{"$nulls":4},{"$f":"'classement club'!C18","v":147},null,10,null,null,0]
[{"$nulls":6},10,null,null,0]
[{"$nulls":6},15,null,null,0]
[{"$nulls":6},10,null,null,0]
[{"$nulls":4},{"$f":"SUM(E8:E23)","v":{"$error":"#REF!"}},{"$f":"F30+F29+F31","v":51585},15,null,null,0]
[{"$nulls":6},10,null,null,0]
[{"$nulls":5},50665,10,{"$f":"SUM(G21:G29)","v":106},3,318]
[{"$nulls":5},920,22]
[{"$nulls":5},0,12]
[{"$nulls":6},15]
[{"$nulls":5},{"$f":"F34*F35","v":2211},12]
[{"$nulls":5},3,12]
[{"$nulls":5},737,12]
[{"$nulls":6},10]
[{"$nulls":5},{"$f":"SUM(G1:G60)","v":687},10]
[{"$nulls":6},10]
[{"$nulls":6},10]
[{"$nulls":6},10]
[{"$nulls":6},10]
[{"$nulls":6},10]
[{"$nulls":6},10]
[{"$nulls":6},10]
[{"$nulls":6},10]
[{"$nulls":6},10]
[{"$nulls":6},30]
[{"$nulls":6},15]
[{"$nulls":6},18]
[{"$nulls":6},10]
[{"$nulls":6},10]
[{"$nulls":6},10]
[{"$nulls":6},10]
[{"$nulls":6},10]
[{"$nulls":6},10]
[{"$nulls":6},10]